Reaction Details
TargetNucleotide-binding oligomerization domain-containing protein 2
LigandBDBM54384
Substrate/Competitorn/a
Meas. Tech.uHTS luminescence assay for the identification of compounds that inhibit NOD2 in MDP treated cells
IC50 1906±n/a nM
Citation PubChem, PC uHTS luminescence assay for the identification of compounds that inhibit NOD2 in MDP treated cells PubChem Bioassay(2010)[AID]
 
Nucleotide-binding oligomerization domain-containing protein 2
Name:Nucleotide-binding oligomerization domain-containing protein 2
Type:PROTEIN
Mol. Mass.:115287.18
Organism:Homo sapiens (Human)
Description:ChEMBL_1454053
Residue:1040
BDBM54384
NameBDBM54384
Synonyms:MLS000757219 N-(4-bromo-1-naphthalenyl)-1-hydroxy-2-naphthalenecarboxamide N-(4-bromonaphthalen-1-yl)-1-hydroxynaphthalene-2-carboxamide cid_353380
TypeSmall organic molecule
Emp. Form.C21H14BrNO2
Mol. Mass.392.245
SMILESOc1c(ccc2ccccc12)C(=O)Nc1ccc(Br)c2ccccc12