Reaction Details
TargetNucleotide-binding oligomerization domain-containing protein 2
LigandBDBM54390
Substrate/Competitorn/a
Meas. Tech.uHTS luminescence assay for the identification of compounds that inhibit NOD2 in MDP treated cells
IC50 1182±n/a nM
Citation PubChem, PC uHTS luminescence assay for the identification of compounds that inhibit NOD2 in MDP treated cells PubChem Bioassay(2010)[AID]
 
Nucleotide-binding oligomerization domain-containing protein 2
Name:Nucleotide-binding oligomerization domain-containing protein 2
Type:PROTEIN
Mol. Mass.:115287.18
Organism:Homo sapiens (Human)
Description:ChEMBL_1454053
Residue:1040
BDBM54390
NameBDBM54390
Synonyms:2-Methyl-3-nitro-1-p-tolyl-1H-indol-6-ol 2-methyl-1-(4-methylphenyl)-3-nitro-indol-6-ol 2-methyl-3-nitro-1-(p-tolyl)indol-6-ol SMR000413809 | cid_899976
TypeSmall organic molecule
Emp. Form.C16H14N2O3
Mol. Mass.282.294
SMILESCc1c([N+]([O-])=O)c2ccc(O)cc2n1-c1ccc(C)cc1