Reaction Details
TargetNucleotide-binding oligomerization domain-containing protein 2
LigandBDBM54431
Substrate/Competitorn/a
Meas. Tech.uHTS luminescence assay for the identification of compounds that inhibit NOD2 in MDP treated cells
IC50 875±n/a nM
Citation PubChem, PC uHTS luminescence assay for the identification of compounds that inhibit NOD2 in MDP treated cells PubChem Bioassay(2010)[AID]
 
Nucleotide-binding oligomerization domain-containing protein 2
Name:Nucleotide-binding oligomerization domain-containing protein 2
Type:PROTEIN
Mol. Mass.:115287.18
Organism:Homo sapiens (Human)
Description:ChEMBL_1454053
Residue:1040
BDBM54431
NameBDBM54431
Synonyms:1-(5-hydroxy-2-methyl-1-p-phenetyl-indol-3-yl)ethanone 1-[1-(4-ethoxyphenyl)-2-methyl-5-oxidanyl-indol-3-yl]ethanone 1-[1-(4-ethoxyphenyl)-5-hydroxy-2-methylindol-3-yl]ethanone SMR000556341 | cid_786617
TypeSmall organic molecule
Emp. Form.C19H19NO3
Mol. Mass.309.3591
SMILESCCOc1ccc(cc1)-n1c(C)c(C(C)=O)c2cc(O)ccc12