Reaction Details
TargetCell division control protein 42 homolog
LigandBDBM54557
Substrate/Competitorn/a
Meas. Tech.Oxadiazole SAR compounds tested by Multiplex dose response to identify specific small molecule inhibitors of Ras and Ras-related GTPases specifically Cdc42 activated mutant
Ki 240±n/a nM
Citation PubChem, PC Oxadiazole SAR compounds tested by Multiplex dose response to identify specific small molecule inhibitors of Ras and Ras-related GTPases specifically Cdc42 activated mutant PubChem Bioassay(2009)[AID]
 
Cell division control protein 42 homolog
Name:Cell division control protein 42 homolog
Type:PROTEIN
Mol. Mass.:21258.36
Organism:Homo sapiens (Human)
Description:ChEMBL_652970
Residue:191
BDBM54557
NameBDBM54557
Synonyms:1-[4-(2,5-dimethylphenyl)-1-piperazinyl]-3-[3-(2-methylphenyl)-1,2,4-oxadiazol-5-yl]-1-propanone 1-[4-(2,5-dimethylphenyl)piperazino]-3-[3-(o-tolyl)-1,2,4-oxadiazol-5-yl]propan-1-one UNM-0000306078 | cid_42596906
TypeSmall organic molecule
Emp. Form.C24H28N4O2
Mol. Mass.404.5047
SMILESCc1ccc(C)c(c1)N1CCN(CC1)C(=O)CCc1nc(no1)-c1ccccc1C