Reaction Details
TargetCell division control protein 42 homolog
LigandBDBM13063
Substrate/Competitorn/a
Meas. Tech.Pyrazoline SAR compounds tested via Multiplex dose response to identify specific small molecule inhibitors of Ras and Ras-related GTPases specifically Cdc42 activated mutant
EC50 30000±n/a nM
Citation PubChem, PC Pyrazoline SAR compounds tested via Multiplex dose response to identify specific small molecule inhibitors of Ras and Ras-related GTPases specifically Cdc42 activated mutant PubChem Bioassay(2009)[AID]
 
Cell division control protein 42 homolog
Name:Cell division control protein 42 homolog
Type:PROTEIN
Mol. Mass.:21258.36
Organism:Homo sapiens (Human)
Description:ChEMBL_652970
Residue:191
BDBM13063
NameBDBM13063
Synonyms:4-(5-methyl-3-phenyl-1,2-oxazol-4-yl)benzene-1-sulfonamide CHEMBL865 Valdecoxib | cid_119607
TypeSmall organic molecule
Emp. Form.C16H14N2O3S
Mol. Mass.314.359
SMILESCc1onc(c1-c1ccc(cc1)S(N)(=O)=O)-c1ccccc1