Reaction Details
TargetCell division control protein 42 homolog
LigandBDBM54551
Substrate/Competitorn/a
Meas. Tech.Oxadiazole SAR compounds tested via Multiplex dose response to identify specific small molecule inhibitors of Ras and Ras-related GTPases specifically Cdc42 wildtype
Ki 340±n/a nM
Citation PubChem, PC Oxadiazole SAR compounds tested via Multiplex dose response to identify specific small molecule inhibitors of Ras and Ras-related GTPases specifically Cdc42 wildtype PubChem Bioassay(2009)[AID]
 
Cell division control protein 42 homolog
Name:Cell division control protein 42 homolog
Type:PROTEIN
Mol. Mass.:21258.36
Organism:Homo sapiens (Human)
Description:ChEMBL_652970
Residue:191
BDBM54551
NameBDBM54551
Synonyms:3-[3-(4-bromophenyl)-1,2,4-oxadiazol-5-yl]-1-[4-(2,5-dimethylphenyl)-1-piperazinyl]-1-propanone 3-[3-(4-bromophenyl)-1,2,4-oxadiazol-5-yl]-1-[4-(2,5-dimethylphenyl)piperazino]propan-1-one UNM-0000306072 | cid_25241708
TypeSmall organic molecule
Emp. Form.C23H25BrN4O2
Mol. Mass.469.374
SMILESCc1ccc(C)c(c1)N1CCN(CC1)C(=O)CCc1nc(no1)-c1ccc(Br)cc1