Reaction Details
TargetCell division control protein 42 homolog
LigandBDBM54580
Substrate/Competitorn/a
Meas. Tech.Oxadiazole SAR compounds tested via Multiplex dose response to identify specific small molecule inhibitors of Ras and Ras-related GTPases specifically Cdc42 wildtype
Ki 250±n/a nM
Citation PubChem, PC Oxadiazole SAR compounds tested via Multiplex dose response to identify specific small molecule inhibitors of Ras and Ras-related GTPases specifically Cdc42 wildtype PubChem Bioassay(2009)[AID]
 
Cell division control protein 42 homolog
Name:Cell division control protein 42 homolog
Type:PROTEIN
Mol. Mass.:21258.36
Organism:Homo sapiens (Human)
Description:ChEMBL_652970
Residue:191
BDBM54580
NameBDBM54580
Synonyms:3-[3-[4-(dimethylamino)phenyl]-1,2,4-oxadiazol-5-yl]-1-[4-(2,5-dimethylphenyl)-1-piperazinyl]-1-propanone 3-[3-[4-(dimethylamino)phenyl]-1,2,4-oxadiazol-5-yl]-1-[4-(2,5-dimethylphenyl)piperazino]propan-1-one UNM-0000306126 | cid_42628047
TypeSmall organic molecule
Emp. Form.C25H31N5O2
Mol. Mass.433.5459
SMILESCN(C)c1ccc(cc1)-c1noc(CCC(=O)N2CCN(CC2)c2cc(C)ccc2C)n1