Reaction Details
TargetGTPase KRas [1-37]
LigandBDBM50110164
Substrate/Competitorn/a
Meas. Tech.Additional SAR compounds tested via Multiplex dose response to identify specific small molecule inhibitors of Ras and Ras-related GTPases specifically Ras wildtype
EC50 30000±n/a nM
Citation PubChem, PC Additional SAR compounds tested via Multiplex dose response to identify specific small molecule inhibitors of Ras and Ras-related GTPases specifically Ras wildtype PubChem Bioassay(2009)[AID]
 
GTPase KRas [1-37]
Name:GTPase KRas [1-37]
Synonyms:ras protein
Type:Enzyme Catalytic Domain
Mol. Mass.:4034.04
Organism:Homo sapiens (Human)
Description:gi_190938
Residue:37
BDBM50110164
NameBDBM50110164
TypeSmall organic molecule
Emp. Form.C20H17FO2S
Mol. Mass.340.411
SMILESCSc1ccc(\C=C2\C(C)=C(CC(O)=O)c3cc(F)ccc23)cc1