Reaction Details
TargetGTPase KRas [1-37]
LigandBDBM54685
Substrate/Competitorn/a
Meas. Tech.Additional SAR compounds tested via Multiplex dose response to identify specific small molecule inhibitors of Ras and Ras-related GTPases specifically Ras wildtype
Ki 5850±n/a nM
Citation PubChem, PC Additional SAR compounds tested via Multiplex dose response to identify specific small molecule inhibitors of Ras and Ras-related GTPases specifically Ras wildtype PubChem Bioassay(2009)[AID]
 
GTPase KRas [1-37]
Name:GTPase KRas [1-37]
Synonyms:ras protein
Type:Enzyme Catalytic Domain
Mol. Mass.:4034.04
Organism:Homo sapiens (Human)
Description:gi_190938
Residue:37
BDBM54685
NameBDBM54685
TypeSmall organic molecule
Emp. Form.C16H10BrN3O2
Mol. Mass.356.174
SMILESONc1c([nH]c2ccccc12)C1=c2cccc(Br)c2=NC1=O