Reaction Details
TargetRas-related C3 botulinum toxin substrate 1
LigandBDBM54680
Substrate/Competitorn/a
Meas. Tech.Additional SAR compounds tested via Multiplex dose response to identify specific small molecule inhibitors of Ras and Ras-related GTPases specifically Rac1 wildtype
EC50 16144±n/a nM
Citation PubChem, PC Additional SAR compounds tested via Multiplex dose response to identify specific small molecule inhibitors of Ras and Ras-related GTPases specifically Rac1 wildtype PubChem Bioassay(2009)[AID]
 
Ras-related C3 botulinum toxin substrate 1
Name:Ras-related C3 botulinum toxin substrate 1
Type:PROTEIN
Mol. Mass.:21455.91
Organism:Mus musculus
Description:EBI_101485
Residue:192
BDBM54680
NameBDBM54680
Synonyms:(3Z)-5-bromanyl-3-(3-oxidanylidene-1H-indol-2-ylidene)-1H-indol-2-one (3Z)-5-bromo-3-(3-oxo-1H-indol-2-ylidene)-1H-indol-2-one cid_5287845
TypeSmall organic molecule
Emp. Form.C16H9BrN2O2
Mol. Mass.341.159
SMILESBrc1ccc2NC(=O)C(=C3Nc4ccccc4C3=O)c2c1