Reaction Details
TargetRas-related C3 botulinum toxin substrate 1
LigandBDBM54703
Substrate/Competitorn/a
Meas. Tech.Additional SAR compounds tested via Multiplex dose response to identify specific small molecule inhibitors of Ras and Ras-related GTPases specifically Rac1 wildtype
EC50 30000±n/a nM
Citation PubChem, PC Additional SAR compounds tested via Multiplex dose response to identify specific small molecule inhibitors of Ras and Ras-related GTPases specifically Rac1 wildtype PubChem Bioassay(2009)[AID]
 
Ras-related C3 botulinum toxin substrate 1
Name:Ras-related C3 botulinum toxin substrate 1
Type:PROTEIN
Mol. Mass.:21455.91
Organism:Mus musculus
Description:EBI_101485
Residue:192
BDBM54703
NameBDBM54703
Synonyms:1-(4-methoxyphenyl)-3-phenyl-2-propyn-1-one 1-(4-methoxyphenyl)-3-phenylprop-2-yn-1-one cid_616715
TypeSmall organic molecule
Emp. Form.C16H12O2
Mol. Mass.236.2653
SMILESCOc1ccc(cc1)C(=O)C#Cc1ccccc1