Reaction Details
TargetRas-related C3 botulinum toxin substrate 1
LigandBDBM54704
Substrate/Competitorn/a
Meas. Tech.Additional SAR compounds tested via Multiplex dose response to identify specific small molecule inhibitors of Ras and Ras-related GTPases specifically Rac1 wildtype
EC50 30000±n/a nM
Citation PubChem, PC Additional SAR compounds tested via Multiplex dose response to identify specific small molecule inhibitors of Ras and Ras-related GTPases specifically Rac1 wildtype PubChem Bioassay(2009)[AID]
 
Ras-related C3 botulinum toxin substrate 1
Name:Ras-related C3 botulinum toxin substrate 1
Type:PROTEIN
Mol. Mass.:21455.91
Organism:Mus musculus
Description:EBI_101485
Residue:192
BDBM54704
NameBDBM54704
Synonyms:UNM-0000306098 sodium;(2S)-2-(6-methoxy-2-naphthalenyl)propanoate sodium;(2S)-2-(6-methoxynaphthalen-2-yl)propanoate
TypeSmall organic molecule
Emp. Form.C14H13O3
Mol. Mass.229.2518
SMILESCOc1ccc2cc(ccc2c1)[C@H](C)C([O-])=O