Reaction Details
TargetRas-related C3 botulinum toxin substrate 1
LigandBDBM54706
Substrate/Competitorn/a
Meas. Tech.Additional SAR compounds tested via Multiplex dose response to identify specific small molecule inhibitors of Ras and Ras-related GTPases specifically Rac1 wildtype
EC50 30000±n/a nM
Citation PubChem, PC Additional SAR compounds tested via Multiplex dose response to identify specific small molecule inhibitors of Ras and Ras-related GTPases specifically Rac1 wildtype PubChem Bioassay(2009)[AID]
 
Ras-related C3 botulinum toxin substrate 1
Name:Ras-related C3 botulinum toxin substrate 1
Type:PROTEIN
Mol. Mass.:21455.91
Organism:Mus musculus
Description:EBI_101485
Residue:192
BDBM54706
NameBDBM54706
Synonyms:2-(6-methoxy-2-naphthalenyl)acetic acid 2-(6-methoxynaphthalen-2-yl)acetic acid UNM-0000306103 cid_32176
TypeSmall organic molecule
Emp. Form.C13H12O3
Mol. Mass.216.2326
SMILESCOc1ccc2cc(CC(O)=O)ccc2c1