Reaction Details
TargetRas-related protein Rab-7a
LigandBDBM13063
Substrate/Competitorn/a
Meas. Tech.Pyrazoline SAR compounds tested via Multiplex dose response to identify specific small molecule inhibitors of Ras and Ras-related GTPases specifically Rab7 wildtype
EC50 30000±n/a nM
Citation PubChem, PC Pyrazoline SAR compounds tested via Multiplex dose response to identify specific small molecule inhibitors of Ras and Ras-related GTPases specifically Rab7 wildtype PubChem Bioassay(2009)[AID]
 
Ras-related protein Rab-7a
Name:Ras-related protein Rab-7a
Type:Enzyme Catalytic Domain
Mol. Mass.:23519.50
Organism:Canis lupus familiaris
Description:gi_164058
Residue:207
BDBM13063
NameBDBM13063
Synonyms:4-(5-methyl-3-phenyl-1,2-oxazol-4-yl)benzene-1-sulfonamide CHEMBL865 Valdecoxib | cid_119607
TypeSmall organic molecule
Emp. Form.C16H14N2O3S
Mol. Mass.314.359
SMILESCc1onc(c1-c1ccc(cc1)S(N)(=O)=O)-c1ccccc1