Reaction Details
TargetRas-related protein Rab-2A
LigandBDBM54612
Substrate/Competitorn/a
Meas. Tech.Pyrazoline SAR compounds tested via Multiplex dose response to identify specific small molecule inhibitors of Ras and Ras-related GTPases specifically Rab2 wildtype
EC50 30000±n/a nM
CommentsExtracted from aid = 2045 and tid = 2
Citation PubChem, PC Pyrazoline SAR compounds tested via Multiplex dose response to identify specific small molecule inhibitors of Ras and Ras-related GTPases specifically Rab2 wildtype PubChem Bioassay(2016)[AID]
 
Ras-related protein Rab-2A
Name:Ras-related protein Rab-2A
Type:Enzyme Catalytic Domain
Mol. Mass.:23545.28
Organism:Canis lupus familiaris
Description:gi_46577642
Residue:212
BDBM54612
NameBDBM54612
Synonyms:2-[4-[bis(fluoranyl)methylsulfonyl]phenyl]-5-(4-bromophenyl)-3-phenyl-3,4-dihydropyrazole 5-(4-bromophenyl)-2-[4-(difluoromethylsulfonyl)phenyl]-3-phenyl-3,4-dihydropyrazole cid_2865099
TypeSmall organic molecule
Emp. Form.C22H17BrF2N2O2S
Mol. Mass.491.348
SMILESFC(F)S(=O)(=O)c1ccc(cc1)N1N=C(CC1c1ccccc1)c1ccc(Br)cc1