Reaction Details
TargetRas-related C3 botulinum toxin substrate 1
LigandBDBM54612
Substrate/Competitorn/a
Meas. Tech.Pyrazoline SAR compounds tested via Multiplex dose response to identify specific small molecule inhibitors of Ras and Ras-related GTPases specifically Rac1 activated mutant
Ki 790±n/a nM
Citation PubChem, PC Pyrazoline SAR compounds tested via Multiplex dose response to identify specific small molecule inhibitors of Ras and Ras-related GTPases specifically Rac1 activated mutant PubChem Bioassay(2009)[AID]
 
Ras-related C3 botulinum toxin substrate 1
Name:Ras-related C3 botulinum toxin substrate 1
Type:PROTEIN
Mol. Mass.:21455.91
Organism:Mus musculus
Description:EBI_101485
Residue:192
BDBM54612
NameBDBM54612
Synonyms:2-[4-[bis(fluoranyl)methylsulfonyl]phenyl]-5-(4-bromophenyl)-3-phenyl-3,4-dihydropyrazole 5-(4-bromophenyl)-2-[4-(difluoromethylsulfonyl)phenyl]-3-phenyl-3,4-dihydropyrazole cid_2865099
TypeSmall organic molecule
Emp. Form.C22H17BrF2N2O2S
Mol. Mass.491.348
SMILESFC(F)S(=O)(=O)c1ccc(cc1)N1N=C(CC1c1ccccc1)c1ccc(Br)cc1