Reaction Details
TargetGTPase KRas [1-37]
LigandBDBM54612
Substrate/Competitorn/a
Meas. Tech.Pyrazoline SAR compounds tested via Multiplex dose response to identify specific small molecule inhibitors of Ras and Ras-related GTPases specifically Ras activated mutant
Ki 180±n/a nM
Citation PubChem, PC Pyrazoline SAR compounds tested via Multiplex dose response to identify specific small molecule inhibitors of Ras and Ras-related GTPases specifically Ras activated mutant PubChem Bioassay(2009)[AID]
 
GTPase KRas [1-37]
Name:GTPase KRas [1-37]
Synonyms:ras protein
Type:Enzyme Catalytic Domain
Mol. Mass.:4034.04
Organism:Homo sapiens (Human)
Description:gi_190938
Residue:37
BDBM54612
NameBDBM54612
TypeSmall organic molecule
Emp. Form.C22H17BrF2N2O2S
Mol. Mass.491.348
SMILESFC(F)S(=O)(=O)c1ccc(cc1)N1N=C(CC1c1ccccc1)c1ccc(Br)cc1