Reaction Details
TargetRas-related C3 botulinum toxin substrate 1
LigandBDBM54553
Substrate/Competitorn/a
Meas. Tech.Oxadiazole SAR compounds tested via Multiplex dose response to identify specific small molecule inhibitors of Ras and Ras-related GTPases specifically Rac1 activated mutant
Ki 120±n/a nM
Citation PubChem, PC Oxadiazole SAR compounds tested via Multiplex dose response to identify specific small molecule inhibitors of Ras and Ras-related GTPases specifically Rac1 activated mutant PubChem Bioassay(2009)[AID]
 
Ras-related C3 botulinum toxin substrate 1
Name:Ras-related C3 botulinum toxin substrate 1
Type:PROTEIN
Mol. Mass.:21455.91
Organism:Mus musculus
Description:EBI_101485
Residue:192
BDBM54553
NameBDBM54553
Synonyms:1-[4-(2,5-dimethylphenyl)-1-piperazinyl]-3-[3-(4-fluorophenyl)-1,2,4-oxadiazol-5-yl]-1-propanone 1-[4-(2,5-dimethylphenyl)piperazino]-3-[3-(4-fluorophenyl)-1,2,4-oxadiazol-5-yl]propan-1-one UNM-0000306074 | cid_42596902
TypeSmall organic molecule
Emp. Form.C23H25FN4O2
Mol. Mass.408.4686
SMILESCc1ccc(C)c(c1)N1CCN(CC1)C(=O)CCc1nc(no1)-c1ccc(F)cc1