Reaction Details
TargetRas-related C3 botulinum toxin substrate 1
LigandBDBM54583
Substrate/Competitorn/a
Meas. Tech.Oxadiazole SAR compounds tested via Multiplex dose response to identify specific small molecule inhibitors of Ras and Ras-related GTPases specifically Rac1 activated mutant
Ki 190±n/a nM
Citation PubChem, PC Oxadiazole SAR compounds tested via Multiplex dose response to identify specific small molecule inhibitors of Ras and Ras-related GTPases specifically Rac1 activated mutant PubChem Bioassay(2009)[AID]
 
Ras-related C3 botulinum toxin substrate 1
Name:Ras-related C3 botulinum toxin substrate 1
Type:PROTEIN
Mol. Mass.:21455.91
Organism:Mus musculus
Description:EBI_101485
Residue:192
BDBM54583
NameBDBM54583
Synonyms:1-[4-(2,5-dimethylphenyl)-1-piperazinyl]-3-[3-(4-methoxyphenyl)-5-isoxazolyl]-1-propanone 1-[4-(2,5-dimethylphenyl)piperazino]-3-[3-(4-methoxyphenyl)isoxazol-5-yl]propan-1-one UNM-0000306149 | cid_44143705
TypeSmall organic molecule
Emp. Form.C25H29N3O3
Mol. Mass.419.5161
SMILESCOc1ccc(cc1)-c1cc(CCC(=O)N2CCN(CC2)c2cc(C)ccc2C)on1