Reaction Details
TargetTyrosine-protein phosphatase non-receptor type 7
LigandBDBM46180
Substrate/Competitorn/a
Meas. Tech.MOA HePTP Fluorescent secondary assay for identification of redox-state modulating compounds
IC50 840±n/a nM
Citation PubChem, PC MOA HePTP Fluorescent secondary assay for identification of redox-state modulating compounds PubChem Bioassay(2009)[AID]
 
Tyrosine-protein phosphatase non-receptor type 7
Name:Tyrosine-protein phosphatase non-receptor type 7
Type:Protein
Mol. Mass.:40530.79
Organism:Homo sapiens (Human)
Description:P35236
Residue:360
BDBM46180
NameBDBM46180
Synonyms:MLS-0202044.0001 N-[2,3-bis(2-furyl)quinoxalin-6-yl]-4-methyl-piperidine-1-carboxamide N-[2,3-bis(furan-2-yl)quinoxalin-6-yl]-4-methylpiperidine-1-carboxamide | cid_2924978
TypeSmall organic molecule
Emp. Form.C23H22N4O3
Mol. Mass.402.4458
SMILESCC1CCN(CC1)C(=O)Nc1ccc2nc(-c3ccco3)c(nc2c1)-c1ccco1