Reaction Details
TargetTyrosine-protein phosphatase non-receptor type 7
LigandBDBM46182
Substrate/Competitorn/a
Meas. Tech.MOA HePTP Fluorescent secondary assay for identification of redox-state modulating compounds
IC50 550±n/a nM
Citation PubChem, PC MOA HePTP Fluorescent secondary assay for identification of redox-state modulating compounds PubChem Bioassay(2009)[AID]
 
Tyrosine-protein phosphatase non-receptor type 7
Name:Tyrosine-protein phosphatase non-receptor type 7
Type:Protein
Mol. Mass.:40530.79
Organism:Homo sapiens (Human)
Description:P35236
Residue:360
BDBM46182
NameBDBM46182
Synonyms:MLS-0202046.0001 N-[2,3-bis(2-furyl)quinoxalin-6-yl]-3-phenyl-pyrrolidine-1-carboxamide N-[2,3-bis(furan-2-yl)quinoxalin-6-yl]-3-phenylpyrrolidine-1-carboxamide | cid_2925154
TypeSmall organic molecule
Emp. Form.C27H22N4O3
Mol. Mass.450.4886
SMILESO=C(Nc1ccc2nc(-c3ccco3)c(nc2c1)-c1ccco1)N1CCC(C1)c1ccccc1