Reaction Details
TargetTyrosine-protein phosphatase non-receptor type 7
LigandBDBM46193
Substrate/Competitorn/a
Meas. Tech.MOA HePTP Fluorescent secondary assay for identification of redox-state modulating compounds
IC50 452±n/a nM
Citation PubChem, PC MOA HePTP Fluorescent secondary assay for identification of redox-state modulating compounds PubChem Bioassay(2009)[AID]
 
Tyrosine-protein phosphatase non-receptor type 7
Name:Tyrosine-protein phosphatase non-receptor type 7
Type:Protein
Mol. Mass.:40530.79
Organism:Homo sapiens (Human)
Description:P35236
Residue:360
BDBM46193
NameBDBM46193
Synonyms:1-[2,3-bis(2-furanyl)-6-quinoxalinyl]-3-butylurea 1-[2,3-bis(furan-2-yl)quinoxalin-6-yl]-3-butyl-urea MLS-0292129.0001 | cid_24178227
TypeSmall organic molecule
Emp. Form.C21H20N4O3
Mol. Mass.376.4085
SMILESCCCCNC(=O)Nc1ccc2nc(-c3ccco3)c(nc2c1)-c1ccco1