Reaction Details
TargetTyrosine-protein phosphatase non-receptor type 7
LigandBDBM46209
Substrate/Competitorn/a
Meas. Tech.MOA HePTP Fluorescent secondary assay for identification of redox-state modulating compounds
IC50 588±n/a nM
Citation PubChem, PC MOA HePTP Fluorescent secondary assay for identification of redox-state modulating compounds PubChem Bioassay(2009)[AID]
 
Tyrosine-protein phosphatase non-receptor type 7
Name:Tyrosine-protein phosphatase non-receptor type 7
Type:Protein
Mol. Mass.:40530.79
Organism:Homo sapiens (Human)
Description:P35236
Residue:360
BDBM46209
NameBDBM46209
Synonyms:1-cyclopropyl-3-(4-sulfamoylphenyl)thiourea cid_891589
TypeSmall organic molecule
Emp. Form.C10H13N3O2S2
Mol. Mass.271.359
SMILESNS(=O)(=O)c1ccc(NC(=S)NC2CC2)cc1