Reaction Details
TargetTyrosine-protein phosphatase non-receptor type 7
LigandBDBM46214
Substrate/Competitorn/a
Meas. Tech.MOA HePTP Fluorescent secondary assay for identification of redox-state modulating compounds
IC50 520±n/a nM
Citation PubChem, PC MOA HePTP Fluorescent secondary assay for identification of redox-state modulating compounds PubChem Bioassay(2009)[AID]
 
Tyrosine-protein phosphatase non-receptor type 7
Name:Tyrosine-protein phosphatase non-receptor type 7
Type:Protein
Mol. Mass.:40530.79
Organism:Homo sapiens (Human)
Description:P35236
Residue:360
BDBM46214
NameBDBM46214
Synonyms:2-[4-[[5-(4-chlorophenyl)-6-ethoxycarbonyl-7-methyl-3-oxidanylidene-5H-[1,3]thiazolo[3,2-a]pyrimidin-2-ylidene]methyl]phenoxy]ethanoic acid 2-[4-[[5-(4-chlorophenyl)-6-ethoxycarbonyl-7-methyl-3-oxo-5H-thiazolo[3,2-a]pyrimidin-2-ylidene]methyl]phenoxy]acetic acid MLS-0351016.0001 | cid_2878586
TypeSmall organic molecule
Emp. Form.C25H21ClN2O6S
Mol. Mass.512.962
SMILESCCOC(=O)C1=C(C)N=c2sc(=Cc3ccc(OCC(O)=O)cc3)c(=O)n2C1c1ccc(Cl)cc1