Reaction Details
TargetTyrosine-protein phosphatase non-receptor type 7
LigandBDBM46225
Substrate/Competitorn/a
Meas. Tech.MOA HePTP Fluorescent secondary assay for identification of redox-state modulating compounds
IC50 105±n/a nM
Citation PubChem, PC MOA HePTP Fluorescent secondary assay for identification of redox-state modulating compounds PubChem Bioassay(2009)[AID]
 
Tyrosine-protein phosphatase non-receptor type 7
Name:Tyrosine-protein phosphatase non-receptor type 7
Type:Protein
Mol. Mass.:40530.79
Organism:Homo sapiens (Human)
Description:P35236
Residue:360
BDBM46225
NameBDBM46225
Synonyms:MLS-0266851.0001 | cid_2545467
TypeSmall organic molecule
Emp. Form.C23H18N2O7S2
Mol. Mass.498.528
SMILESCCOC(=O)c1sc2nc3c(SCC(O)=O)cc(cn3c(=O)c2c1C)C(=O)c1ccccc1O