Reaction Details
TargetTyrosine-protein phosphatase non-receptor type 7
LigandBDBM46223
Substrate/Competitorn/a
Meas. Tech.MOA HePTP Fluorescent secondary assay for identification of redox-state modulating compounds
IC50 3160±n/a nM
Citation PubChem, PC MOA HePTP Fluorescent secondary assay for identification of redox-state modulating compounds PubChem Bioassay(2009)[AID]
 
Tyrosine-protein phosphatase non-receptor type 7
Name:Tyrosine-protein phosphatase non-receptor type 7
Type:Protein
Mol. Mass.:40530.79
Organism:Homo sapiens (Human)
Description:P35236
Residue:360
BDBM46223
NameBDBM46223
Synonyms:(4Z)-2-methoxy-4-[piperidin-1-yl(sulfanyl)methylidene]cyclohexa-2,5-dien-1-one (4Z)-4-[mercapto(piperidino)methylene]-2-methoxy-cyclohexa-2,5-dien-1-one cid_5336454
TypeSmall organic molecule
Emp. Form.C13H17NO2S
Mol. Mass.251.345
SMILESCOc1cc(ccc1O)C(=S)N1CCCCC1