Reaction Details
TargetBcl-2-like protein 2
LigandBDBM33097
Substrate/Competitorn/a
Meas. Tech.Confirmation dose response of hits from multiplexed high-throughput screen for small molecule regulators of Bcl-2 family protein interactions, specifically Bim-Bcl-W
EC50 620±n/a nM
Citation PubChem, PC Confirmation dose response of hits from multiplexed high-throughput screen for small molecule regulators of Bcl-2 family protein interactions, specifically Bim-Bcl-W PubChem Bioassay(2009)[AID]
 
Bcl-2-like protein 2
Name:Bcl-2-like protein 2
Type:Protein
Mol. Mass.:20742.61
Organism:Homo sapiens (Human)
Description:n/a
Residue:193
BDBM33097
NameBDBM33097
Synonyms:3-[[7-(1,3-benzothiazol-2-ylsulfanyl)-4-nitro-2,1,3-benzoxadiazol-5-yl]amino]propyl acetate MLS000521052 acetic acid 3-[[7-(1,3-benzothiazol-2-ylthio)-4-nitro-2,1,3-benzoxadiazol-5-yl]amino]propyl ester cid_11957209
TypeSmall organic molecule
Emp. Form.C18H15N5O5S2
Mol. Mass.445.472
SMILESCC(=O)OCCCNc1cc(Sc2nc3ccccc3s2)c2nonc2c1[N+]([O-])=O