Reaction Details
TargetTyrosine-protein phosphatase non-receptor type 22
LigandBDBM48802
Substrate/Competitorn/a
Meas. Tech.LYP1 Fluorescent Assay using OMFP substrate for In Vitro dose response studies.
IC50 4829.175±n/a nM
Citation PubChem, PC LYP1 Fluorescent Assay using OMFP substrate for In Vitro dose response studies. PubChem Bioassay(2009)[AID]
 
Tyrosine-protein phosphatase non-receptor type 22
Name:Tyrosine-protein phosphatase non-receptor type 22
Type:n/a
Mol. Mass.:91712.31
Organism:Homo sapiens (Human)
Description:Q9Y2R2
Residue:807
BDBM48802
NameBDBM48802
Synonyms:2-[2-ethoxy-4-[[[4-[2-(4-methylanilino)-1,3-thiazol-4-yl]benzoyl]hydrazinylidene]methyl]phenoxy]acetic acid 2-[2-ethoxy-4-[[[4-[2-[(4-methylphenyl)amino]-1,3-thiazol-4-yl]phenyl]carbonylhydrazinylidene]methyl]phenoxy]ethanoic acid MLS000713540 cid_3143475
TypeSmall organic molecule
Emp. Form.C28H26N4O5S
Mol. Mass.530.595
SMILESCCOc1cc(C=NNC(=O)c2ccc(cc2)-c2csc(Nc3ccc(C)cc3)n2)ccc1OCC(O)=O