Reaction Details
TargetTyrosine-protein phosphatase non-receptor type 7
LigandBDBM46236
Substrate/Competitorn/a
Meas. Tech.HTS HePTP Fluorescent Assay using OMFP substrate for In Vitro dose response studies
IC50 37467±0 nM
Citation PubChem, PC HTS HePTP Fluorescent Assay using OMFP substrate for In Vitro dose response studies PubChem Bioassay(2009)[AID]
 
Tyrosine-protein phosphatase non-receptor type 7
Name:Tyrosine-protein phosphatase non-receptor type 7
Type:Protein
Mol. Mass.:40530.79
Organism:Homo sapiens (Human)
Description:P35236
Residue:360
BDBM46236
NameBDBM46236
Synonyms:4-[8-[(3-chloranyl-2-methyl-phenyl)sulfamoyl]-3a,4,5,9b-tetrahydro-3H-cyclopenta[c]quinolin-4-yl]benzoic acid 4-[8-[(3-chloro-2-methylphenyl)sulfamoyl]-3a,4,5,9b-tetrahydro-3H-cyclopenta[c]quinolin-4-yl]benzoic acid cid_2975144
TypeSmall organic molecule
Emp. Form.C26H23ClN2O4S
Mol. Mass.494.99
SMILESCc1c(Cl)cccc1NS(=O)(=O)c1ccc2NC(C3CC=CC3c2c1)c1ccc(cc1)C(O)=O