Reaction Details
TargetTyrosine-protein phosphatase non-receptor type 22
LigandBDBM46237
Substrate/Competitorn/a
Meas. Tech.SAR LYP1 Fluorescent Assay using pCAP substrate for In Vitro dose response studies
IC50 2957±n/a nM
Citation PubChem, PC SAR LYP1 Fluorescent Assay using pCAP substrate for In Vitro dose response studies PubChem Bioassay(2009)[AID]
 
Tyrosine-protein phosphatase non-receptor type 22
Name:Tyrosine-protein phosphatase non-receptor type 22
Type:n/a
Mol. Mass.:91712.31
Organism:Homo sapiens (Human)
Description:Q9Y2R2
Residue:807
BDBM46237
NameBDBM46237
Synonyms:4-[3-[(5Z)-4-keto-2-thioxo-5-veratrylidene-thiazolidin-3-yl]propanoylamino]benzoic acid 4-[3-[(5Z)-5-[(3,4-dimethoxyphenyl)methylidene]-4-oxo-2-sulfanylidene-1,3-thiazolidin-3-yl]propanoylamino]benzoic acid MLS-0329775.0001 | cid_1587127
TypeSmall organic molecule
Emp. Form.C22H20N2O6S2
Mol. Mass.472.534
SMILESCOc1ccc(\C=C2/SC(=S)N(CCC(=O)Nc3ccc(cc3)C(O)=O)C2=O)cc1OC