Reaction Details
TargetKappa-type opioid receptor
LigandBDBM33163
Substrate/Competitorn/a
Meas. Tech.HTS Image-Based Screen for Selective Antagonists of the KOR Receptor
IC50 16493±1990 nM
Citation PubChem, PC HTS Image-Based Screen for Selective Antagonists of the KOR Receptor PubChem Bioassay(2009)[AID]
 
Kappa-type opioid receptor
Name:Kappa-type opioid receptor
Type:G Protein-Coupled Receptor (GPCR)
Mol. Mass.:42648.76
Organism:Homo sapiens (Human)
Description:P41145
Residue:380
BDBM33163
NameBDBM33163
Synonyms:MLS000677960 acetic acid;2-methyl-3-[(4-oxo-1-cyclohexa-2,5-dienylidene)amino]-5-phenyl-4-thieno[2,3-d]pyrimidinone acetic acid;3-[(4-ketocyclohexa-2,5-dien-1-ylidene)amino]-2-methyl-5-phenyl-thieno[2,3-d]pyrimidin-4-one ethanoic acid;2-methyl-3-[(4-oxidanylidenecyclohexa-2,5-dien-1-ylidene)amino]-5-phenyl-thieno[2,3-d]pyrimidin-4-one
TypeSmall organic molecule
Emp. Form.C19H13N3O2S
Mol. Mass.347.39
SMILES[#6]-c1nc2scc(-c3ccccc3)c2c(=O)n1\[#7]=[#6]-1/[#6]=[#6]-[#6](=O)-[#6]=[#6]-1