Reaction Details
TargetMitogen-activated protein kinase kinase kinase 3
LigandBDBM54958
Substrate/Competitorn/a
Meas. Tech.SAR Compounds tested by Dose Response Screen via Multiplex HTS Assay for Inhibitors of MEK Kinase PB1 Domains, specifically MEK5 binding to MEK Kinase 3 Wildtype.
EC50>30000±n/a nM
Citation PubChem, PC SAR Compounds tested by Dose Response Screen via Multiplex HTS Assay for Inhibitors of MEK Kinase PB1 Domains, specifically MEK5 binding to MEK Kinase 3 Wildtype. PubChem Bioassay(2009)[AID]
 
Mitogen-activated protein kinase kinase kinase 3
Name:Mitogen-activated protein kinase kinase kinase 3
Type:PROTEIN
Mol. Mass.:70916.05
Organism:Homo sapiens (Human)
Description:ChEMBL_774345
Residue:626
BDBM54958
NameBDBM54958
Synonyms:6-(3-methoxyphenyl)-3-(2-pyridinyl)-[1,2,4]triazolo[3,4-b][1,3,4]thiadiazole 6-(3-methoxyphenyl)-3-pyridin-2-yl-[1,2,4]triazolo[3,4-b][1,3,4]thiadiazole cid_662681
TypeSmall organic molecule
Emp. Form.C15H11N5OS
Mol. Mass.309.346
SMILESCOc1cccc(c1)-c1nn2c(nnc2s1)-c1ccccn1