Reaction Details
TargetMitogen-activated protein kinase kinase kinase kinase 2
LigandBDBM54959
Substrate/Competitorn/a
Meas. Tech.Dose Response of SAR compounds via Multiplex HTS Assay for Inhibitors of MEK Kinase PB1 Domains, specifically MEK5 binding to MEK Kinase 2 Wildtype
EC50>30000±n/a nM
Citation PubChem, PC Dose Response of SAR compounds via Multiplex HTS Assay for Inhibitors of MEK Kinase PB1 Domains, specifically MEK5 binding to MEK Kinase 2 Wildtype PubChem Bioassay(2009)[AID]
 
Mitogen-activated protein kinase kinase kinase kinase 2
Name:Mitogen-activated protein kinase kinase kinase kinase 2
Type:n/a
Mol. Mass.:91551.35
Organism:Homo sapiens (Human)
Description:n/a
Residue:820
BDBM54959
NameBDBM54959
Synonyms:3-(2-furyl)-6-m-phenetyl-[1,2,4]triazolo[3,4-b][1,3,4]thiadiazole 6-(3-ethoxyphenyl)-3-(furan-2-yl)-[1,2,4]triazolo[3,4-b][1,3,4]thiadiazole cid_662842
TypeSmall organic molecule
Emp. Form.C15H12N4O2S
Mol. Mass.312.346
SMILESCCOc1cccc(c1)-c1nn2c(nnc2s1)-c1ccco1