Reaction Details
TargetMitogen-activated protein kinase kinase kinase kinase 2
LigandBDBM54955
Substrate/Competitorn/a
Meas. Tech.SAR Compounds tested by Dose Response Screen via Multiplex HTS Assay for Inhibitors of MEK Kinase PB1 Domains, specifically MEK5 binding to MEK Kinase 2 Mutant.
EC50>30000±n/a nM
Citation PubChem, PC SAR Compounds tested by Dose Response Screen via Multiplex HTS Assay for Inhibitors of MEK Kinase PB1 Domains, specifically MEK5 binding to MEK Kinase 2 Mutant. PubChem Bioassay(2009)[AID]
 
Mitogen-activated protein kinase kinase kinase kinase 2
Name:Mitogen-activated protein kinase kinase kinase kinase 2
Type:n/a
Mol. Mass.:91551.35
Organism:Homo sapiens (Human)
Description:n/a
Residue:820
BDBM54955
NameBDBM54955
Synonyms:(6Z)-3-(2-pyridinyl)-6-(2-pyrrolylidene)-5H-[1,2,4]triazolo[3,4-b][1,3,4]thiadiazole (6Z)-3-pyridin-2-yl-6-pyrrol-2-ylidene-5H-[1,2,4]triazolo[3,4-b][1,3,4]thiadiazole cid_44236877
TypeSmall organic molecule
Emp. Form.C12H8N6S
Mol. Mass.268.297
SMILESc1c[nH]c(c1)-c1nn2c(nnc2s1)-c1ccccn1