Reaction Details
TargetCore protein
LigandBDBM40694
Substrate/Competitorn/a
Meas. Tech.TR-FRET-based biochemical high-throughput dose response assay to identify inhibitors of Hepatitis C Virus (HCV) core protein dimerization.
IC50>49751±n/a nM
Citation PubChem, PC TR-FRET-based biochemical high-throughput dose response assay to identify inhibitors of Hepatitis C Virus (HCV) core protein dimerization. PubChem Bioassay(2009)[AID]
 
Core protein
Name:Core protein
Synonyms:n/a
Type:Enzyme Catalytic Domain
Mol. Mass.:14237.71
Organism:Hepatitis C virus
Description:gi_83779224
Residue:126
BDBM40694
NameBDBM40694
TypeSmall organic molecule
Emp. Form.C25H21N3O6
Mol. Mass.459.4507
SMILESO=C(COC(=O)c1cc(nc2ccccc12)-c1ccco1)N1CCN(CC1)C(=O)c1ccco1