Reaction Details
TargetCore protein
LigandBDBM41075
Substrate/Competitorn/a
Meas. Tech.TR-FRET-based biochemical high-throughput dose response assay to identify inhibitors of Hepatitis C Virus (HCV) core protein dimerization.
IC50>49751±n/a nM
Citation PubChem, PC TR-FRET-based biochemical high-throughput dose response assay to identify inhibitors of Hepatitis C Virus (HCV) core protein dimerization. PubChem Bioassay(2009)[AID]
 
Core protein
Name:Core protein
Synonyms:n/a
Type:Enzyme Catalytic Domain
Mol. Mass.:14237.71
Organism:Hepatitis C virus
Description:gi_83779224
Residue:126
BDBM41075
NameBDBM41075
TypeSmall organic molecule
Emp. Form.C27H24N4O7S
Mol. Mass.548.567
SMILESCCOc1ccc(cc1)S(=O)(=O)N(CC(=O)N\N=C\c1ccc(o1)-c1ccc(cc1)[N+]([O-])=O)c1ccccc1