Reaction Details
TargetCore protein
LigandBDBM54972
Substrate/Competitorn/a
Meas. Tech.TR-FRET-based biochemical high-throughput dose response assay to identify inhibitors of Hepatitis C Virus (HCV) core protein dimerization.
IC50>49751±n/a nM
Citation PubChem, PC TR-FRET-based biochemical high-throughput dose response assay to identify inhibitors of Hepatitis C Virus (HCV) core protein dimerization. PubChem Bioassay(2009)[AID]
 
Core protein
Name:Core protein
Synonyms:n/a
Type:Enzyme Catalytic Domain
Mol. Mass.:14237.71
Organism:Hepatitis C virus
Description:gi_83779224
Residue:126
BDBM54972
NameBDBM54972
TypeSmall organic molecule
Emp. Form.C24H18N4O7
Mol. Mass.474.4223
SMILESCOc1cc([CH+]c2c(C)[n-]n(-c3ccccc3)c2=O)ccc1Oc1ccc(cc1[N+]([O-])=O)[N+]([O-])=O