Reaction Details
TargetCore protein
LigandBDBM54975
Substrate/Competitorn/a
Meas. Tech.TR-FRET-based biochemical high-throughput dose response assay to identify inhibitors of Hepatitis C Virus (HCV) core protein dimerization.
IC50>49751±n/a nM
Citation PubChem, PC TR-FRET-based biochemical high-throughput dose response assay to identify inhibitors of Hepatitis C Virus (HCV) core protein dimerization. PubChem Bioassay(2009)[AID]
 
Core protein
Name:Core protein
Synonyms:n/a
Type:Enzyme Catalytic Domain
Mol. Mass.:14237.71
Organism:Hepatitis C virus
Description:gi_83779224
Residue:126
BDBM54975
NameBDBM54975
TypeSmall organic molecule
Emp. Form.C24H25N3O5S
Mol. Mass.467.537
SMILESCOc1ccc(NC(=O)c2c3CCCc3nc3ccccc23)cc1S(=O)(=O)N1CCOCC1