Reaction Details
TargetCore protein
LigandBDBM48754
Substrate/Competitorn/a
Meas. Tech.TR-FRET-based biochemical high-throughput dose response assay to identify inhibitors of Hepatitis C Virus (HCV) core protein dimerization.
IC50>49751±n/a nM
Citation PubChem, PC TR-FRET-based biochemical high-throughput dose response assay to identify inhibitors of Hepatitis C Virus (HCV) core protein dimerization. PubChem Bioassay(2009)[AID]
 
Core protein
Name:Core protein
Synonyms:n/a
Type:Enzyme Catalytic Domain
Mol. Mass.:14237.71
Organism:Hepatitis C virus
Description:gi_83779224
Residue:126
BDBM48754
NameBDBM48754
TypeSmall organic molecule
Emp. Form.C24H14ClN5O4
Mol. Mass.471.852
SMILES[O-][N+](=O)c1ccc2[N-]C(=O)\C(=[NH+]/NC(=O)c3cc(nc4ccccc34)-c3ccccc3Cl)c2c1