Reaction Details
Target2'-phosphotransferase
LigandBDBM55009
Substrate/Competitorn/a
Meas. Tech.Fluorescence polarization-based biochemical high throughput dose response assay to identify inhibitors of tRNA 2'-phosphotransferase (TPT1).
IC50>55688±n/a nM
Citation PubChem, PC Fluorescence polarization-based biochemical high throughput dose response assay to identify inhibitors of tRNA 2'-phosphotransferase (TPT1). PubChem Bioassay(2009)[AID]
 
2'-phosphotransferase
Name:2'-phosphotransferase
Synonyms:likely tRNA 2'-phosphotransferase
Type:Enzyme Catalytic Domain
Mol. Mass.:23631.37
Organism:Candida albicans SC5314
Description:gi_68476498
Residue:207
BDBM55009
NameBDBM55009
TypeSmall organic molecule
Emp. Form.C20H15N5O3
Mol. Mass.373.3648
SMILESCc1ccc2nc(N=NCc3ccc(o3)[N+]([O-])=O)nc(-c3ccccc3)c2c1