Reaction Details
Target2'-phosphotransferase
LigandBDBM50729
Substrate/Competitorn/a
Meas. Tech.Fluorescence polarization-based biochemical high throughput dose response assay to identify inhibitors of tRNA 2'-phosphotransferase (TPT1).
IC50 20824±n/a nM
Citation PubChem, PC Fluorescence polarization-based biochemical high throughput dose response assay to identify inhibitors of tRNA 2'-phosphotransferase (TPT1). PubChem Bioassay(2009)[AID]
 
2'-phosphotransferase
Name:2'-phosphotransferase
Synonyms:likely tRNA 2'-phosphotransferase
Type:Enzyme Catalytic Domain
Mol. Mass.:23631.37
Organism:Candida albicans SC5314
Description:gi_68476498
Residue:207
BDBM50729
NameBDBM50729
TypeSmall organic molecule
Emp. Form.C16H12N2O4S3
Mol. Mass.392.472
SMILESO=C1N(NS(=O)(=O)c2ccccc2)C(=S)S\C1=C/C=C/c1ccco1