Reaction Details
Target2'-phosphotransferase
LigandBDBM55013
Substrate/Competitorn/a
Meas. Tech.Fluorescence polarization-based biochemical high throughput dose response assay to identify inhibitors of tRNA 2'-phosphotransferase (TPT1).
IC50 274.94±n/a nM
Citation PubChem, PC Fluorescence polarization-based biochemical high throughput dose response assay to identify inhibitors of tRNA 2'-phosphotransferase (TPT1). PubChem Bioassay(2009)[AID]
 
2'-phosphotransferase
Name:2'-phosphotransferase
Synonyms:likely tRNA 2'-phosphotransferase
Type:Enzyme Catalytic Domain
Mol. Mass.:23631.37
Organism:Candida albicans SC5314
Description:gi_68476498
Residue:207
BDBM55013
NameBDBM55013
TypeSmall organic molecule
Emp. Form.C19H14ClFN2O5S
Mol. Mass.436.841
SMILESCOc1cc(\C=C2/SC(=O)N(CC(=O)Nc3ccccc3F)C2=O)cc(Cl)c1O