Reaction Details
TargetMetabotropic glutamate receptor 4 [Q124R]
LigandBDBM50293723
Substrate/Competitorn/a
Meas. Tech.Modulation of the Metabotropic Glutamate Receptor mGluR4: Rat PAM Potency
EC50 3580±n/a nM
Citation PubChem, PC Modulation of the Metabotropic Glutamate Receptor mGluR4: Rat PAM Potency PubChem Bioassay(2010)[AID]
 
Metabotropic glutamate receptor 4 [Q124R]
Name:Metabotropic glutamate receptor 4 [Q124R]
Type:Enzyme Catalytic Domain
Mol. Mass.:101878.86
Organism:Rattus norvegicus
Description:gi_12083595
Residue:912
BDBM50293723
NameBDBM50293723
Synonyms:CHEMBL551004 cid_308065
TypeSmall organic molecule
Emp. Form.C11H7Cl2NO2
Mol. Mass.256.085
SMILESClc1ccc(NC(=O)c2ccco2)cc1Cl