Reaction Details
TargetMetabotropic glutamate receptor 4 [Q124R]
LigandBDBM50293714
Substrate/Competitorn/a
Meas. Tech.Modulation of the Metabotropic Glutamate Receptor mGluR4: Rat PAM Potency
EC50 374±n/a nM
Citation PubChem, PC Modulation of the Metabotropic Glutamate Receptor mGluR4: Rat PAM Potency PubChem Bioassay(2010)[AID]
 
Metabotropic glutamate receptor 4 [Q124R]
Name:Metabotropic glutamate receptor 4 [Q124R]
Type:Enzyme Catalytic Domain
Mol. Mass.:101878.86
Organism:Rattus norvegicus
Description:gi_12083595
Residue:912
BDBM50293714
NameBDBM50293714
Synonyms:CHEMBL551635 cid_42644786
TypeSmall organic molecule
Emp. Form.C13H11FN2O2
Mol. Mass.246.237
SMILESCOc1cc(NC(=O)c2ccccn2)ccc1F