Reaction Details
TargetMetabotropic glutamate receptor 4 [Q124R]
LigandBDBM50293720
Substrate/Competitorn/a
Meas. Tech.Modulation of the Metabotropic Glutamate Receptor mGluR4: Rat PAM Potency
EC50 78.3±n/a nM
Citation PubChem, PC Modulation of the Metabotropic Glutamate Receptor mGluR4: Rat PAM Potency PubChem Bioassay(2010)[AID]
 
Metabotropic glutamate receptor 4 [Q124R]
Name:Metabotropic glutamate receptor 4 [Q124R]
Type:Enzyme Catalytic Domain
Mol. Mass.:101878.86
Organism:Rattus norvegicus
Description:gi_12083595
Residue:912
BDBM50293720
NameBDBM50293720
Synonyms:CHEMBL541754 cid_44189740
TypeSmall organic molecule
Emp. Form.C13H10F2N2O2
Mol. Mass.264.2275
SMILESFC(F)Oc1cccc(NC(=O)c2ccccn2)c1