Reaction Details
TargetM18 aspartyl aminopeptidase
LigandBDBM55109
Substrate/Competitorn/a
Meas. Tech.QFRET-based biochemical high throughput dose response assay for inhibitors of the Plasmodium falciparum M18 Aspartyl Aminopeptidase (PFM18AAP).
IC50 350.82±n/a nM
Citation PubChem, PC QFRET-based biochemical high throughput dose response assay for inhibitors of the Plasmodium falciparum M18 Aspartyl Aminopeptidase (PFM18AAP). PubChem Bioassay(2009)[AID]
 
M18 aspartyl aminopeptidase
Name:M18 aspartyl aminopeptidase
Synonyms:n/a
Type:Enzyme Catalytic Domain
Mol. Mass.:65642.43
Organism:Plasmodium falciparum 3D7
Description:gi_23505220
Residue:570
BDBM55109
NameBDBM55109
TypeSmall organic molecule
Emp. Form.C12H14N4O4S
Mol. Mass.310.329
SMILESCOC(=O)CN(n1cnnc1)S(=O)(=O)c1ccc(C)cc1