Reaction Details
TargetM18 aspartyl aminopeptidase
LigandBDBM55157
Substrate/Competitorn/a
Meas. Tech.QFRET-based biochemical high throughput dose response assay for inhibitors of the Plasmodium falciparum M18 Aspartyl Aminopeptidase (PFM18AAP).
IC50 1066±n/a nM
Citation PubChem, PC QFRET-based biochemical high throughput dose response assay for inhibitors of the Plasmodium falciparum M18 Aspartyl Aminopeptidase (PFM18AAP). PubChem Bioassay(2009)[AID]
 
M18 aspartyl aminopeptidase
Name:M18 aspartyl aminopeptidase
Synonyms:n/a
Type:Enzyme Catalytic Domain
Mol. Mass.:65642.43
Organism:Plasmodium falciparum 3D7
Description:gi_23505220
Residue:570
BDBM55157
NameBDBM55157
TypeSmall organic molecule
Emp. Form.C13H17N5O3S
Mol. Mass.323.371
SMILESCCN(CC)S(=O)(=O)c1ccc(cc1)C(=O)Nn1cnnc1