Reaction Details
TargetMetabotropic glutamate receptor 4
LigandBDBM50293723
Substrate/Competitorn/a
Meas. Tech.Modulation of the Metabotropic Glutamate Receptor mGluR4: Potency at human mGluR4
EC50 4540±n/a nM
Citation PubChem, PC Modulation of the Metabotropic Glutamate Receptor mGluR4: Potency at human mGluR4 PubChem Bioassay(2010)[AID]
 
Metabotropic glutamate receptor 4
Name:Metabotropic glutamate receptor 4
Type:Protein
Mol. Mass.:101899.95
Organism:Homo sapiens (Human)
Description:Q14833
Residue:912
BDBM50293723
NameBDBM50293723
Synonyms:CHEMBL551004 cid_308065
TypeSmall organic molecule
Emp. Form.C11H7Cl2NO2
Mol. Mass.256.085
SMILESClc1ccc(NC(=O)c2ccco2)cc1Cl