Reaction Details
TargetMetabotropic glutamate receptor 4
LigandBDBM50293721
Substrate/Competitorn/a
Meas. Tech.Modulation of the Metabotropic Glutamate Receptor mGluR4: Potency at human mGluR4
EC50 239±n/a nM
Citation PubChem, PC Modulation of the Metabotropic Glutamate Receptor mGluR4: Potency at human mGluR4 PubChem Bioassay(2010)[AID]
 
Metabotropic glutamate receptor 4
Name:Metabotropic glutamate receptor 4
Type:Protein
Mol. Mass.:101899.95
Organism:Homo sapiens (Human)
Description:Q14833
Residue:912
BDBM50293721
NameBDBM50293721
Synonyms:CHEMBL562551 cid_44191096
TypeSmall organic molecule
Emp. Form.C13H11ClN2O2
Mol. Mass.262.692
SMILESCOc1cc(NC(=O)c2ccccn2)ccc1Cl