Reaction Details
TargetMetabotropic glutamate receptor 4
LigandBDBM50293719
Substrate/Competitorn/a
Meas. Tech.Modulation of the Metabotropic Glutamate Receptor mGluR4: Potency at human mGluR4
EC50 3550±n/a nM
Citation PubChem, PC Modulation of the Metabotropic Glutamate Receptor mGluR4: Potency at human mGluR4 PubChem Bioassay(2010)[AID]
 
Metabotropic glutamate receptor 4
Name:Metabotropic glutamate receptor 4
Type:Protein
Mol. Mass.:101899.95
Organism:Homo sapiens (Human)
Description:Q14833
Residue:912
BDBM50293719
NameBDBM50293719
Synonyms:CHEMBL571453 cid_2306530
TypeSmall organic molecule
Emp. Form.C13H9F3N2O
Mol. Mass.266.2186
SMILESFC(F)(F)c1cccc(NC(=O)c2ccccn2)c1